Target
Cyclin-dependent kinase 1
Ligand
BDBM2546
Substrate
Meas. Tech.
Kinase Assay
IC50
5±n/a nM
Citation
 Lücking, ULücking, MKrüger, RSiemeister, G Sulfoximine-substituted pyrimidines as CDK- and/or VEGF inhibitors, their production and use as pharmaceutical agents US Patent  US8507510 Publication Date 8/13/2013 
Target
Name:
Cyclin-dependent kinase 1
Synonyms:
CDC2 CDK1 CDKN1 Cell division protein kinase 1 P34CDC2 | p34 protein kinase
Type:
Enzyme Subunit
Mol. Mass.:
34101.08
Organism:
Homo sapiens (Human)
Description:
P06493
Residue:
297
  
Inhibitor
Name:
BDBM2546
Synonyms:
US8507510, 1.42
Type:
Emp. Form.:
C16H22BrN5O2S
Mol. Mass.:
428.347
SMILES:
C[C@H](Nc1nc(Nc2ccc(cc2)S(C)(=N)=O)ncc1Br)C(C)(C)O
: