Target
Vascular endothelial growth factor receptor 2
Ligand
BDBM2546
Substrate
Meas. Tech.
Kinase Assay
IC50
64±n/a nM
Citation
 Lücking, ULücking, MKrüger, RSiemeister, G Sulfoximine-substituted pyrimidines as CDK- and/or VEGF inhibitors, their production and use as pharmaceutical agents US Patent  US8507510 Publication Date 8/13/2013 
Target
Name:
Vascular endothelial growth factor receptor 2
Synonyms:
CD_antigen=CD309 Fetal liver kinase 1 (FLK-1) KDR Protein-tyrosine kinase receptor Flk-1 VEGFR-2 VEGFR2 Vascular Endothelial Growth Factor Receptor Kinase 2 Vascular endothelial growth factor receptor 2 (KDR) Vascular endothelial growth factor receptor 2 (VEGFR2) Vascular endothelial growth factor receptor-2 (VEGFR-2)
Type:
Receptor Tyrosine Kinase
Mol. Mass.:
151510.97
Organism:
Homo sapiens (Human)
Description:
P35968
Residue:
1356
  
Inhibitor
Name:
BDBM2546
Synonyms:
US8507510, 1.42
Type:
Emp. Form.:
C16H22BrN5O2S
Mol. Mass.:
428.347
SMILES:
C[C@H](Nc1nc(Nc2ccc(cc2)S(C)(=N)=O)ncc1Br)C(C)(C)O
: