Target
Beta-secretase 1
Ligand
BDBM101025
Substrate
Meas. Tech.
Inhibition Assay
IC50
1.7e+2±n/a nM
Citation
 Tamura, YSuzuki, STada, YFujikoshi, CMatsumoto, SKooriyama, Y Aminodihydrothiazine derivatives substituted with a cyclic group US Patent  US8507479 Publication Date 8/13/2013 
Target
Name:
Beta-secretase 1
Synonyms:
ASP2 Aspartyl protease 2 BACE1 Beta-secretase (BACE) Beta-secretase 1 (BACE 1) Beta-secretase 1 (BACE1) Beta-site amyloid precursor protein cleaving enzyme 1 Memapsin-2 beta-Secretase (BACE-1) | beta-Secretase (BACE1)
Type:
Protein
Mol. Mass.:
55755.10
Organism:
Homo sapiens (Human)
Description:
P56817
Residue:
501
  
Inhibitor
Name:
BDBM101025
Synonyms:
US8507479, 662
Type:
Small organic molecule
Emp. Form.:
C17H16F3N5OS
Mol. Mass.:
395.402
SMILES:
Cc1cnc(cn1)C(=O)Nc1ccc(F)c(c1)[C@@]1(C)N=C(N)SCC1(F)F
: