Target
Orexin/Hypocretin receptor type 1
Ligand
BDBM102249
Substrate
Meas. Tech.
FLIPR Assay
pH
7.4±0
Ki
700±n/a nM
Citation
 Badiger, SBehnke, DBetschart, CChaudhari, VCotesta, SHinrichs, JHOfner, SPandit, CWagner, J Diaza-spiro[5.5]undecanes US Patent  US8530648 Publication Date 9/10/2013 
Target
Name:
Orexin/Hypocretin receptor type 1
Synonyms:
HCRTR1 OX1R_HUMAN Orexin receptor type 1 (OR 1) Orexin receptor type 1 (OX1) Orexin receptor type 1 (OxR1) | Ox1r
Type:
Protein
Mol. Mass.:
47554.50
Organism:
Homo sapiens (Human)
Description:
O43613
Residue:
425
  
Inhibitor
Name:
BDBM102249
Synonyms:
US8530648, 186
Type:
Small organic molecule
Emp. Form.:
C26H27FN4O3
Mol. Mass.:
462.516
SMILES:
Fc1cc(CN2CCCC3(CCN(CC3)c3cnc4ccccc4n3)C2=O)c2OCOCc2c1
: