Target
Orexin receptor type 2
Ligand
BDBM102249
Substrate
Meas. Tech.
FLIPR Assay
pH
7.4±0
Ki
125±n/a nM
Citation
 Badiger, SBehnke, DBetschart, CChaudhari, VCotesta, SHinrichs, JHOfner, SPandit, CWagner, J Diaza-spiro[5.5]undecanes US Patent  US8530648 Publication Date 9/10/2013 
Target
Name:
Orexin receptor type 2
Synonyms:
HCRTR2 OX2R_HUMAN Orexin receptor type 2 (OR-2) Orexin receptor type 2 (OX2R) Ox-2-R | Ox2-R
Type:
Protein
Mol. Mass.:
50710.53
Organism:
Homo sapiens (Human)
Description:
O43614
Residue:
444
  
Inhibitor
Name:
BDBM102249
Synonyms:
US8530648, 186
Type:
Small organic molecule
Emp. Form.:
C26H27FN4O3
Mol. Mass.:
462.516
SMILES:
Fc1cc(CN2CCCC3(CCN(CC3)c3cnc4ccccc4n3)C2=O)c2OCOCc2c1
: