Target
Protein kinase C delta type
Ligand
BDBM102423
Substrate
Kd
0.21±0.02 nM
Citation
 Kedei, NLewin, NEGéczy, TGéczy, JBraun, DCChen, JHerrmann, MAHeldman, MRLim, LMannan, PGarfield, SHPoudel, YBCummins, TJRudra, ABlumberg, PMKeck, GE Biological profile of the less lipophilic and synthetically more accessible bryostatin 7 closely resembles that of bryostatin 1. ACS Chem Biol 8:767-77 (2013)  
Target
Name:
Protein kinase C delta type
Synonyms:
KPCD_HUMAN PKCD Protein Kinase C- delta nPKC-delta
Type:
Enzyme
Mol. Mass.:
77516.79
Organism:
Homo sapiens (Human)
Description:
The recombinant human PKC enzymes were produced using a baculovirus expression system in SF9 cells
Residue:
676
  
Inhibitor
Name:
BDBM102423
Synonyms:
Bryostatin | Bryostatin 7
Type:
Small organic molecule
Emp. Form.:
C41H60O17
Mol. Mass.:
824.9049
SMILES:
COC(=O)\C=C1\C[C@H]2C[C@]3(O)O[C@@H](C[C@H](OC(C)=O)C3(C)C)C[C@@H](O)CC(=O)O[C@H](C[C@@H]3C\C(=C/C(=O)OC)[C@H](OC(C)=O)[C@@](O)(O3)C(C)(C)\C=C\[C@@H](C1)O2)[C@@H](C)O
: