Target
Dihydroorotate dehydrogenase (quinone), mitochondrial
Ligand
BDBM102459
Substrate
Meas. Tech.
Inhibition Assay
pH
8±0
IC50
109±0.0 nM
Citation
 Castro Palomino Laria, JCTerricabras Belart, EErra Sola, MNavarro Romero, EFonquerna Pou, SCardus Figueras, ALozoya Toribio, ME Azabiphenylaminobenzoic acid derivatives as DHODH inhibitors US Patent  US8536165 Publication Date 9/17/2013 
Target
Name:
Dihydroorotate dehydrogenase (quinone), mitochondrial
Synonyms:
DHODH Dihydroorotate dehydrogenase Dihydroorotate dehydrogenase, mitochondrial Dihydroorotate oxidase (DHODH) | PYRD_HUMAN
Type:
Enzyme
Mol. Mass.:
42881.33
Organism:
Homo sapiens (Human)
Description:
Q02127
Residue:
395
  
Inhibitor
Name:
BDBM102459
Synonyms:
US8536165, 34
Type:
Small organic molecule
Emp. Form.:
C18H14ClN3O2
Mol. Mass.:
339.776
SMILES:
Cc1ccc(Nc2ccc(nc2)-c2ccncc2Cl)c(c1)C(O)=O
: