Target
Mitogen-activated protein kinase 8
Ligand
BDBM102616
Substrate
Meas. Tech.
In Vitro Inhibition Assay
pH
7.5±0
IC50
26.8±n/a nM
Citation
 Gong, LHan, XMakra, FPalmer, WSRaptova, L Inhibitors of JNK US Patent  US8536172 Publication Date 9/17/2013 
Target
Name:
Mitogen-activated protein kinase 8
Synonyms:
JNK-46 JNK1-alpha-1 MK08_HUMAN PRKM8 SAPK1C c-Jun N-terminal kinase 1 c-Jun N-terminal kinase 1(JNK1) | c-Jun N-terminal kinase 2 (JNK2)
Type:
Enzyme
Mol. Mass.:
48297.57
Organism:
Homo sapiens (Human)
Description:
JNK-1 was purchased from Upstate Cell Signaling Solutions (formerly Upstate Biotechnology).
Residue:
427
  
Inhibitor
Name:
BDBM102616
Synonyms:
US8536172, I-65
Type:
Small organic molecule
Emp. Form.:
C26H34N6O4S
Mol. Mass.:
526.651
SMILES:
CCOC(=O)[C@H]1CC[C@@H](CC1)Nc1nccc(n1)-n1ncc2c(cccc12)N1CCC(CC1)S(C)(=O)=O
: