Target
Serine/threonine-protein kinase receptor R3
Ligand
BDBM36354
Substrate
IC50
77.9±0.0 nM
Citation
 Mohedas, AHXing, XArmstrong, KABullock, ANCuny, GDYu, PB Development of an ALK2-Biased BMP Type I Receptor Kinase Inhibitor. ACS Chem Biol 8:1291-302 (2013)  
Target
Name:
Serine/threonine-protein kinase receptor R3
Synonyms:
ACVL1_MOUSE AI427544 Acvrl1 Alk-1
Type:
Protein
Mol. Mass.:
56529.91
Organism:
Mus musculus
Description:
Residue:
502
  
Inhibitor
Name:
BDBM36354
Synonyms:
4-(6-(4-isopropoxyphenyl)pyrazolo[1,5-a]pyrimidin- 3-yl)quinoline US9040694, 1
Type:
Small organic molecule
Emp. Form.:
C24H20N4O
Mol. Mass.:
380.4418
SMILES:
CC(C)Oc1ccc(cc1)-c1cnc2c(cnn2c1)-c1ccnc2ccccc12
: