Target
Tumor necrosis factor
Ligand
BDBM102839
Substrate
Meas. Tech.
Inhibition Assay
Ki
0.18±0.0 nM
IC50
274±0.0 nM
Citation
 Kozlowski, JAYu, WWong, MKKim, SHTong, LLavey, BJShankar, BBYang, DFeltz, RKosinski, AMZhou, GRizvi, RKDai, CFire, LGirijavallabhan, VLi, DPopovici-Muller, JRichard, JERosner, KESiddiqui, MAYang, L Compounds for the treatment of inflammatory disorders US Patent  US8541572 Publication Date 9/24/2013 
Target
Name:
Tumor necrosis factor
Synonyms:
Cachectin TNF-a TNFA TNFSF2 Tumor necrosis factor (TNFa) Tumor necrosis factor ligand superfamily member 2 Tumor necrosis factor, soluble form | tumor necrosis factor alpha
Type:
Enzyme
Mol. Mass.:
25645.11
Organism:
Homo sapiens (Human)
Description:
P01375
Residue:
233
  
Inhibitor
Name:
BDBM102839
Synonyms:
US8541572, 916
Type:
Small organic molecule
Emp. Form.:
C26H25N5O6
Mol. Mass.:
503.5066
SMILES:
COc1ccc2CN(C[C@]3(NC(=O)NC3=O)C#Cc3cccc(c3)C(N=O)N3CCOCC3)C(=O)c2c1
: