Target
Tumor necrosis factor
Ligand
BDBM50332285
Substrate
Meas. Tech.
Inhibition Assay
Ki
0.29±0.0 nM
IC50
238±0.0 nM
Citation
 Kozlowski, JAYu, WWong, MKKim, SHTong, LLavey, BJShankar, BBYang, DFeltz, RKosinski, AMZhou, GRizvi, RKDai, CFire, LGirijavallabhan, VLi, DPopovici-Muller, JRichard, JERosner, KESiddiqui, MAYang, L Compounds for the treatment of inflammatory disorders US Patent  US8541572 Publication Date 9/24/2013 
Target
Name:
Tumor necrosis factor
Synonyms:
Cachectin TNF-a TNFA TNFSF2 Tumor necrosis factor (TNFa) Tumor necrosis factor ligand superfamily member 2 Tumor necrosis factor, soluble form | tumor necrosis factor alpha
Type:
Enzyme
Mol. Mass.:
25645.11
Organism:
Homo sapiens (Human)
Description:
P01375
Residue:
233
  
Inhibitor
Name:
BDBM50332285
Synonyms:
(R)-5-((4-((4-ethylpiperazin-1-yl)methyl)phenyl)ethynyl)-5-((6-methoxy-1-oxoisoindolin-2-yl)methyl)imidazolidine-2,4-dione US8541572, 515
Type:
Small organic molecule
Emp. Form.:
C28H31N5O4
Mol. Mass.:
501.5768
SMILES:
CCN1CCN(Cc2ccc(cc2)C#C[C@]2(CN3Cc4ccc(OC)cc4C3=O)NC(=O)NC2=O)CC1
: