Target
Cystic fibrosis transmembrane conductance regulator
Ligand
BDBM281051
Substrate
Meas. Tech.
Ussing Chamber Assay
EC50
181±n/a nM
Citation
 Hadida Ruah, SSGrootenhuis, PDVan Goor, FFZhou, JBear, BRMiller, MTMcCartney, JNuma, MM Modulators of ATP-binding cassette transporters US Patent  US10022352 Publication Date 7/17/2018 
Target
Name:
Cystic fibrosis transmembrane conductance regulator
Synonyms:
ABCC7 CFTR Channel conductance-controlling ATPase | cAMP-dependent chloride channel
Type:
Enzyme Catalytic Domain
Mol. Mass.:
168171.30
Organism:
Homo sapiens (Human)
Description:
gi_90421313
Residue:
1480
  
Inhibitor
Name:
BDBM281051
Synonyms:
US10022352, Compound 312
Type:
Small organic molecule
Emp. Form.:
C26H25F2N3O4
Mol. Mass.:
481.4912
SMILES:
CC(C)(C)c1cc2c(C#N)c(NC(=O)C3(CC3)c3ccc4OC(F)(F)Oc4c3)ccc2n1CCO
: