Target
Melatonin receptor type 1A
Ligand
BDBM103440
Substrate
Meas. Tech.
Binding Assay
IC50
0.19±0.0 nM
Citation
 Uchikawa, OKoike, THoashi, YTakai, T Tricyclic compound and pharmaceutical use thereof US Patent  US8552037 Publication Date 10/8/2013 
Target
Name:
Melatonin receptor type 1A
Synonyms:
MTNR1A MTR1A_HUMAN Mel1a melatonin receptor Melatonin receptor Melatonin receptor type 1 (MT1) | Melatonin receptor type 1A
Type:
Enzyme
Mol. Mass.:
39392.94
Organism:
Homo sapiens (Human)
Description:
P48039
Residue:
350
  
Inhibitor
Name:
BDBM103440
Synonyms:
US8552037, 86
Type:
Small organic molecule
Emp. Form.:
C15H16N2OS
Mol. Mass.:
272.365
SMILES:
CC(=O)NCC=C1CCc2ccc3nc(C)sc3c12
: