Target
Melatonin receptor type 1B
Ligand
BDBM103450
Substrate
Meas. Tech.
Binding Assay
IC50
0.12±0.0 nM
Citation
 Uchikawa, OKoike, THoashi, YTakai, T Tricyclic compound and pharmaceutical use thereof US Patent  US8552037 Publication Date 10/8/2013 
Target
Name:
Melatonin receptor type 1B
Synonyms:
MTNR1B Mel-1B-R Melatonin 1B Melatonin receptor type 1B | Melatonin receptor type 2 (MT2)
Type:
Enzyme
Mol. Mass.:
40203.54
Organism:
Homo sapiens (Human)
Description:
P49286
Residue:
362
  
Inhibitor
Name:
BDBM103450
Synonyms:
US8552037, 98
Type:
Small organic molecule
Emp. Form.:
C15H18N2OS
Mol. Mass.:
274.381
SMILES:
CC(=O)NCC[C@@H]1CCc2ccc3nc(C)sc3c12
: