Target
Melatonin receptor type 1B
Ligand
BDBM103456
Substrate
Meas. Tech.
Binding Assay
IC50
0.14±0.0 nM
Citation
 Uchikawa, OKoike, THoashi, YTakai, T Tricyclic compound and pharmaceutical use thereof US Patent  US8552037 Publication Date 10/8/2013 
Target
Name:
Melatonin receptor type 1B
Synonyms:
MTNR1B Mel-1B-R Melatonin 1B Melatonin receptor type 1B | Melatonin receptor type 2 (MT2)
Type:
Enzyme
Mol. Mass.:
40203.54
Organism:
Homo sapiens (Human)
Description:
P49286
Residue:
362
  
Inhibitor
Name:
BDBM103456
Synonyms:
US8552037, 123
Type:
Small organic molecule
Emp. Form.:
C15H15F3N2O2
Mol. Mass.:
312.287
SMILES:
Cc1nc2ccc3CCC(CCNC(=O)C(F)(F)F)c3c2o1
: