Target
Genome polyprotein
Ligand
BDBM103836
Substrate
Meas. Tech.
Enzyme Inhibition Assay
Ki
0.46±0.0 nM
Citation
 Ali, AAydin, CGildemeister, RRomano, KPCao, HOzen, ASoumana, DNewton, APetropoulos, CJHuang, WSchiffer, CA Evaluating the Role of Macrocycles in the Susceptibility of Hepatitis C Virus NS3/4A Protease Inhibitors to Drug Resistance. ACS Chem Biol 8:1469-78 (2013)  
Target
Name:
Genome polyprotein
Synonyms:
Dipeptidyl peptidase 4 (DPP4) NS3 NS5B NS3-4A Protease NS3/4A protease POLG_HCV77 | RNA polymerase (NS5B)
Type:
Protease Domain
Mol. Mass.:
327221.49
Organism:
Hepatitis C virus (HCV genotype 1a, isolate H)
Description:
P27958
Residue:
3011
  
Inhibitor
Name:
BDBM103836
Synonyms:
Vaniprevir
Type:
Small organic molecule
Emp. Form.:
C38H55N5O9S
Mol. Mass.:
757.936
SMILES:
CC[C@@H]1C[C@]1(NC(=O)[C@@H]1C[C@@H]2CN1C(=O)[C@@H](NC(=O)OCC(C)(C)CCCCc1cccc3CN(Cc13)C(=O)O2)C(C)(C)C)C(=O)NS(=O)(=O)C1CC1
: