Target
Genome polyprotein
Ligand
BDBM103837
Substrate
Meas. Tech.
Enzyme Inhibition Assay
Ki
0.22±0.0 nM
Citation
 Ali, AAydin, CGildemeister, RRomano, KPCao, HOzen, ASoumana, DNewton, APetropoulos, CJHuang, WSchiffer, CA Evaluating the Role of Macrocycles in the Susceptibility of Hepatitis C Virus NS3/4A Protease Inhibitors to Drug Resistance. ACS Chem Biol 8:1469-78 (2013)  
Target
Name:
Genome polyprotein
Synonyms:
Dipeptidyl peptidase 4 (DPP4) NS3 NS5B NS3-4A Protease NS3/4A protease POLG_HCV77 | RNA polymerase (NS5B)
Type:
Protease Domain
Mol. Mass.:
327221.49
Organism:
Hepatitis C virus (HCV genotype 1a, isolate H)
Description:
P27958
Residue:
3011
  
Inhibitor
Name:
BDBM103837
Synonyms:
Dan-mcP2P4
Type:
Small organic molecule
Emp. Form.:
C38H53N5O9S
Mol. Mass.:
755.921
SMILES:
CC(C)(C)[C@@H]1NC(=O)OCC(C)(C)CCCCc2cccc3CN(Cc23)C(=O)O[C@@H]2CC(N(C2)C1=O)C(=O)N[C@@]1(C[C@H]1C=C)C(=O)NS(=O)(=O)C1CC1
: