Target
Genome polyprotein
Ligand
BDBM103839
Substrate
Meas. Tech.
Enzyme Inhibition Assay
IC50
0.24±0.0 nM
Citation
 Ali, AAydin, CGildemeister, RRomano, KPCao, HOzen, ASoumana, DNewton, APetropoulos, CJHuang, WSchiffer, CA Evaluating the Role of Macrocycles in the Susceptibility of Hepatitis C Virus NS3/4A Protease Inhibitors to Drug Resistance. ACS Chem Biol 8:1469-78 (2013)  
Target
Name:
Genome polyprotein
Synonyms:
Dipeptidyl peptidase 4 (DPP4) NS3 NS5B NS3-4A Protease NS3/4A protease POLG_HCV77 | RNA polymerase (NS5B)
Type:
Protease Domain
Mol. Mass.:
327221.49
Organism:
Hepatitis C virus (HCV genotype 1a, isolate H)
Description:
P27958
Residue:
3011
  
Inhibitor
Name:
BDBM103839
Synonyms:
Danoprevir
Type:
Small organic molecule
Emp. Form.:
C35H46FN5O9S
Mol. Mass.:
731.831
SMILES:
CC(C)(C)OC(=O)NC1CCCCC\C=C/[C@@H]2C[C@]2(NC(=O)[C@@H]2C[C@H](CN2C1=O)OC(=O)N1Cc2cccc(F)c2C1)C(=O)NS(=O)(=O)C1CC1
: