Target
Genome polyprotein
Ligand
BDBM103840
Substrate
Meas. Tech.
Enzyme Inhibition Assay
IC50
0.23±0.0 nM
Citation
 Ali, AAydin, CGildemeister, RRomano, KPCao, HOzen, ASoumana, DNewton, APetropoulos, CJHuang, WSchiffer, CA Evaluating the Role of Macrocycles in the Susceptibility of Hepatitis C Virus NS3/4A Protease Inhibitors to Drug Resistance. ACS Chem Biol 8:1469-78 (2013)  
Target
Name:
Genome polyprotein
Synonyms:
Dipeptidyl peptidase 4 (DPP4) NS3 NS5B NS3-4A Protease NS3/4A protease POLG_HCV77 | RNA polymerase (NS5B)
Type:
Protease Domain
Mol. Mass.:
327221.49
Organism:
Hepatitis C virus (HCV genotype 1a, isolate H)
Description:
P27958
Residue:
3011
  
Inhibitor
Name:
BDBM103840
Synonyms:
Asu-mcP1P3
Type:
Small organic molecule
Emp. Form.:
C36H46ClN5O9S
Mol. Mass.:
760.297
SMILES:
COc1cnc(O[C@@H]2C[C@@H]3N(C2)C(=O)[C@H](CCCCC\C=C/[C@@H]2C[C@]2(NC3=O)C(=O)NS(=O)(=O)C2CC2)NC(=O)OC(C)(C)C)c2cc(Cl)ccc12
: