Target
Genome polyprotein
Ligand
BDBM103841
Substrate
Meas. Tech.
Enzyme Inhibition Assay
IC50
0.26±0.0 nM
Citation
 Ali, AAydin, CGildemeister, RRomano, KPCao, HOzen, ASoumana, DNewton, APetropoulos, CJHuang, WSchiffer, CA Evaluating the Role of Macrocycles in the Susceptibility of Hepatitis C Virus NS3/4A Protease Inhibitors to Drug Resistance. ACS Chem Biol 8:1469-78 (2013)  
Target
Name:
Genome polyprotein
Synonyms:
Dipeptidyl peptidase 4 (DPP4) NS3 NS5B NS3-4A Protease NS3/4A protease POLG_HCV77 | RNA polymerase (NS5B)
Type:
Protease Domain
Mol. Mass.:
327221.49
Organism:
Hepatitis C virus (HCV genotype 1a, isolate H)
Description:
P27958
Residue:
3011
  
Inhibitor
Name:
BDBM103841
Synonyms:
5172-mcP1P3
Type:
Small organic molecule
Emp. Form.:
C37H50N6O9S
Mol. Mass.:
754.893
SMILES:
CCc1nc2ccc(OC)cc2nc1O[C@@H]1C[C@@H]2N(C1)C(=O)[C@H](CCCCC\C=C/[C@@H]1C[C@]1(NC2=O)C(=O)NS(=O)(=O)C1CC1)NC(=O)OC(C)(C)C
: