Target
Melanin-concentrating hormone receptor 1
Ligand
BDBM103902
Substrate
Meas. Tech.
Radioligand Binding Assay
pH
7.4±0
Ki
2341±0.0 nM
Citation
 Ahmad, SWashburn, WNHernandez, ASRobl, JANgu, KWang, Z Pyridone analogs useful as melanin concentrating hormone receptor-1 antagonists US Patent  US8563583 Publication Date 10/22/2013 
Target
Name:
Melanin-concentrating hormone receptor 1
Synonyms:
G-protein coupled receptor 24 MCH receptor 1 MCH-R1 MCHR-1 MCHR1_HUMAN Melanin-Concentrating Hormone Receptor 1 (MCH1R) Melanin-concentrating hormone receptor 1 (MCH-1) Melanin-concentrating hormone receptor 1 (MCHR-1) SLC-1 Somatostatin receptor-like protein
Type:
G Protein-Coupled Receptor (GPCR)
Mol. Mass.:
45976.27
Organism:
Homo sapiens (Human)
Description:
Membranes from CHO-K1 cells stably expressing human MCH1R were used in assays.
Residue:
422
  
Inhibitor
Name:
BDBM103902
Synonyms:
Disubstituted aryl-Me ATX inhibitor 9 | US8563583, A-6
Type:
Small organic molecule
Emp. Form.:
C22H24N2O5
Mol. Mass.:
396.4364
SMILES:
COc1cc(ccc1OCC(C)(C)O)-n1ccc(COc2ccccn2)cc1=O
: