Target
Fucose-binding lectin PA-IIL
Ligand
BDBM104006
Substrate
IC50
3.4e+3± 4e+2 nM
Kd
3.3e+3±n/a nM
Citation
 Hauck, DJoachim, IFrommeyer, BVarrot, APhilipp, BMöller, HMMöller, AExner, TETitz, A Discovery of two classes of potent glycomimetic inhibitors of Pseudomonas aeruginosa LecB with distinct binding modes. ACS Chem Biol 8:1775-84 (2013)  
Target
Name:
Fucose-binding lectin PA-IIL
Synonyms:
LecB | PA-IIL
Type:
Protein
Mol. Mass.:
11857.84
Organism:
Pseudomonas aeruginosa
Description:
Q9HYN5
Residue:
115
  
Inhibitor
Name:
BDBM104006
Synonyms:
LecB Inhibitor Sulfonamides 5e
Type:
Small organic molecule
Emp. Form.:
C16H25NO7S
Mol. Mass.:
375.437
SMILES:
COC1O[C@H](CNS(=O)(=O)c2c(C)cc(C)cc2C)[C@@H](O)C(O)[C@@H]1O
: