Target
AP2-associated protein kinase 1
Ligand
BDBM311264
Substrate
Meas. Tech.
AAK1 Kinase Assay
IC50
0.510±n/a nM
Citation
 Luo, G Biaryl kinase inhibitors US Patent  US10351563 Publication Date 7/16/2019 
Target
Name:
AP2-associated protein kinase 1
Synonyms:
AAK1 Adaptor-associated kinase 1 | KIAA1048
Type:
PROTEIN
Mol. Mass.:
103884.23
Organism:
Homo sapiens (Human)
Description:
ChEMBL_774569
Residue:
961
  
Inhibitor
Name:
BDBM311264
Synonyms:
(S)-methyl (5-((2-amino-2,4-dimethylpentyl)oxy)-4-(difluoromethyl)-[2,4′-bipyridin]-2′-yl)carbamate US10351563, Example 120 US10723734, Example 120 US9902722, Example 120
Type:
Small organic molecule
Emp. Form.:
C20H26F2N4O3
Mol. Mass.:
408.4422
SMILES:
COC(=O)Nc1cc(ccn1)-c1cc(C(F)F)c(OC[C@@](C)(N)CC(C)C)cn1
: