Target
5-hydroxytryptamine receptor 6
Ligand
BDBM104278
Substrate
Meas. Tech.
Binding Assay
Ki
17±0.0 nM
Citation
 Guzzo, PRHenderson, AJNacro, KIsherwood, MLGhosh, AXiang, K Epiminocycloalkyl[b] indole derivatives as serotonin sub-type 6 (5-HT6) modulators and uses thereof US Patent  US8575186 Publication Date 11/5/2013 
Target
Name:
5-hydroxytryptamine receptor 6
Synonyms:
5-HT-6 5-hydroxytryptamine receptor 6 (5-HT-6) 5-hydroxytryptamine receptor 6 (5HT6) HTR6 Serotonin 6 (5-HT6) receptor | Serotonin Receptor 6
Type:
G Protein-Coupled Receptor (GPCR)
Mol. Mass.:
46968.43
Organism:
Homo sapiens (Human)
Description:
P50406
Residue:
440
  
Inhibitor
Name:
BDBM104278
Synonyms:
US8575186, 41
Type:
Small organic molecule
Emp. Form.:
C21H22N2O3S
Mol. Mass.:
382.476
SMILES:
COc1cccc(c1)S(=O)(=O)c1ccc2n(C)c3CC4CCC(N4)c3c2c1
: