Target
Suppressor of tumorigenicity 14 protein
Ligand
BDBM104908
Substrate
Meas. Tech.
Inhibition Assay
Ki
0.74±0.0 nM
Citation
 Steinmetzer, TSchweinitz, ADonnecke, D Meta-substituted phenyl sulfonyl amides of secondary amino acid amides, the production thereof, and use thereof as matriptase inhibitors US Patent  US8569313 Publication Date 10/29/2013 
Target
Name:
Suppressor of tumorigenicity 14 protein
Synonyms:
Epithin MT-SP1 PRSS14 SNC19 ST14_HUMAN Suppressor of tumorigenicity 14 protein TADG15
Type:
Single-pass type II membrane protein
Mol. Mass.:
94769.23
Organism:
Homo sapiens (Human)
Description:
Q9Y5Y6
Residue:
855
  
Inhibitor
Name:
BDBM104908
Synonyms:
CHEMBL468270 | US8569313, Inhibitor 16
Type:
Small organic molecule
Emp. Form.:
C27H40N6O3S
Mol. Mass.:
528.71
SMILES:
NCCCCc1cccc(c1)S(=O)(=O)N[C@@H](Cc1cccc(c1)C(N)=N)C(=O)N1CCC(CCN)CC1
: