Target
Leucine-rich repeat serine/threonine-protein kinase 2
Ligand
BDBM105115
Substrate
Meas. Tech.
In Vitro Inhibition Assay
Ki
5±n/a nM
Citation
 Chan, BKChen, HEstrada, AShore, DSweeney, ZMcIver, EG Compounds and their administration for treating a neurodegenerative disease as well as a method for identifying a compound capable of inhibiting a kinase, such as LRRK US Patent  US8569281 Publication Date 10/29/2013 
Target
Name:
Leucine-rich repeat serine/threonine-protein kinase 2
Synonyms:
Dardarin LRRK2_HUMAN Leucine-rich repeat serine/threonine-protein kinase 2 PARK8
Type:
Protein
Mol. Mass.:
286113.20
Organism:
Homo sapiens (Human)
Description:
Q5S007
Residue:
2527
  
Inhibitor
Name:
BDBM105115
Synonyms:
US8569281, 132
Type:
Small organic molecule
Emp. Form.:
C19H16ClN3O2
Mol. Mass.:
353.802
SMILES:
Clc1ccccc1C#Cc1[nH]nc2ccnc(OC3CCOCC3)c12
: