Target
Sodium-dependent serotonin transporter
Ligand
BDBM105207
Substrate
Meas. Tech.
In vitro Binding Affinity Assay
pH
7.7±n/a
Temperature
298.15±n/a K
Ki
24.0±2.6 nM
Comments
extracted
Citation
 Gabrielsen, MWolosewicz, KZawadzka, AKossakowski, JNowak, GWolak, MStachowicz, KSiwek, ARavna, AWKufareva, IKozerski, LBednarek, ESitkowski, JBocian, WAbagyan, RBojarski, AJSylte, IChilmonczyk, Z Synthesis, antidepressant evaluation and docking studies of long-chain alkylnitroquipazines as serotonin transporter inhibitors. Chem Biol Drug Des 81:695-706 (2013)  
Target
Name:
Sodium-dependent serotonin transporter
Synonyms:
5-HT Transporter 5HT transporter Anandamid membrane transporter, AMT Monoamine transporters; Norepinephrine & serotonin Slc6a4 Sodium-dependent serotonin transporter (SERT) | imipramine receptor
Type:
Multi-pass membrane protein
Mol. Mass.:
70168.43
Organism:
Rattus norvegicus (rat)
Description:
P31652
Residue:
630
  
Inhibitor
Name:
BDBM105207
Synonyms:
2-(4-Butyl-piperazin-1-yl)-6-nitroquinoline (4)
Type:
Small organic molecule
Emp. Form.:
C17H22N4O2
Mol. Mass.:
314.3822
SMILES:
CCCCN1CCN(CC1)c1ccc2cc(ccc2n1)[N+]([O-])=O
: