Target
Phosphatidylinositol 4,5-bisphosphate 3-kinase catalytic subunit gamma isoform
Ligand
BDBM281510
Substrate
Meas. Tech.
PI3K-gamma Scintillation Proximity Assay
pH
6.7±n/a
Temperature
298.15±n/a K
IC50
<250±n/a nM
Comments
extracted
Citation
 Zou, GCombs, APBuesking, AW Aza-heteroaryl compounds as PI3K-gamma inhibitors US Patent  US10022387 Publication Date 7/17/2018 
Target
Name:
Phosphatidylinositol 4,5-bisphosphate 3-kinase catalytic subunit gamma isoform
Synonyms:
PI3-kinase p110 subunit gamma PI3Kgamma PK3CG_HUMAN Phosphatidylinositol 4,5-bisphosphate 3-kinase (PI3K) Phosphatidylinositol 4,5-bisphosphate 3-kinase catalytic subunit gamma (PI3Kgamma) Phosphatidylinositol 4,5-bisphosphate 3-kinase catalytic subunit gamma isoform (PI3K) Phosphatidylinositol-4,5-bisphosphate 3-kinase catalytic subunit gamma isoform Phosphoinositide 3-kinases gamma (PI3K gamma) p120-PI3K
Type:
Enzyme Subunit
Mol. Mass.:
126470.30
Organism:
Homo sapiens (Human)
Description:
P48736
Residue:
1102
  
Inhibitor
Name:
BDBM281510
Synonyms:
US10022387, Example 36 US9586949, Example 36
Type:
Small organic molecule
Emp. Form.:
C20H14N4O3S
Mol. Mass.:
390.415
SMILES:
CS(=O)(=O)c1cncc(c1)-c1ccc2nc(oc2c1)-c1nc2ccccc2[nH]1
: