Target
3-phosphoinositide-dependent protein kinase 1
Ligand
BDBM47059
Substrate
Meas. Tech.
Kinase Assay
IC50
21±n/a nM
Citation
 Engelhardt, HKofink, CMcConnell, D Chemical compounds US Patent  US8575203 Publication Date 11/5/2013 
Target
Name:
3-phosphoinositide-dependent protein kinase 1
Synonyms:
3-Phosphoinositide-Dependent Protein Kinase 1 (PDK1) 3-phosphoinositide-dependent protein kinase 1 3-phosphoinositide-dependent protein kinase 1 (PDK-1) Isoform 2 of 3-phosphoinositide-dependent protein kinase 1 PDPK1 Phosphoinositide-dependent protein kinase 1 (PDK1) hPDK1
Type:
Enzyme
Mol. Mass.:
63157.65
Organism:
Homo sapiens (Human)
Description:
O15530
Residue:
556
  
Inhibitor
Name:
BDBM47059
Synonyms:
US8575203, I-69 | US8575203, II-69
Type:
Emp. Form.:
C25H18F2N6O3
Mol. Mass.:
488.4456
SMILES:
CNC(=O)c1cnc2ccc(cc2n1)C#CCNC(=O)c1cncn(Cc2ccc(F)c(F)c2)c1=O
: