Target
3-phosphoinositide-dependent protein kinase 1
Ligand
BDBM105263
Substrate
Meas. Tech.
Kinase Assay
IC50
2±0.0 nM
Citation
 Engelhardt, HKofink, CMcConnell, D Chemical compounds US Patent  US8575203 Publication Date 11/5/2013 
Target
Name:
3-phosphoinositide-dependent protein kinase 1
Synonyms:
3-Phosphoinositide-Dependent Protein Kinase 1 (PDK1) 3-phosphoinositide-dependent protein kinase 1 3-phosphoinositide-dependent protein kinase 1 (PDK-1) Isoform 2 of 3-phosphoinositide-dependent protein kinase 1 PDPK1 Phosphoinositide-dependent protein kinase 1 (PDK1) hPDK1
Type:
Enzyme
Mol. Mass.:
63157.65
Organism:
Homo sapiens (Human)
Description:
O15530
Residue:
556
  
Inhibitor
Name:
BDBM105263
Synonyms:
US8575203, I-30
Type:
Small organic molecule
Emp. Form.:
C31H30F2N6O2
Mol. Mass.:
556.6057
SMILES:
C[C@H](c1ccc(F)c(F)c1)n1cccc(C(=O)NCC#Cc2ccc3ncc(NC4CCN(C)CC4)nc3c2)c1=O
: