Target
P2X purinoceptor 3
Ligand
BDBM105536
Substrate
Meas. Tech.
Inhibiton Assay
IC50
580±n/a nM
Citation
 Kai, HTaoda, YEndoh, TAsahi, KTobinaga, H Pyrolinone derivative and pharmaceutical composition comprising the same US Patent  US8575197 Publication Date 11/5/2013 
Target
Name:
P2X purinoceptor 3
Synonyms:
ATP receptor P2RX3 P2X purinoceptor 3 P2X purinoceptor 3 (P2X3) P2X3 purinoceptor p2x3 + hsa
Type:
Protein
Mol. Mass.:
44292.02
Organism:
Homo sapiens (Human)
Description:
P56373
Residue:
397
  
Inhibitor
Name:
BDBM105536
Synonyms:
US8575197, I-046
Type:
Small organic molecule
Emp. Form.:
C26H31NO4
Mol. Mass.:
421.5286
SMILES:
COc1ccccc1C1C(C(=O)C(C)(C)C)C(=O)C(=O)N1c1ccc(cc1)C(C)(C)C
: