Target
Nitric oxide synthase, endothelial
Ligand
BDBM106743
Substrate
Meas. Tech.
Enzyme Assay
IC50
9.91e+3±n/a nM
Citation
 Maddaford, SRamnauth, JRakhit, SPatman, JRenton, PAnnedi, SC Substituted indole compounds having NOS inhibitory activity US Patent  US8586620 Publication Date 11/19/2013 
Target
Name:
Nitric oxide synthase, endothelial
Synonyms:
Constitutive NOS Endothelial NOS NOS type III NOS3_HUMAN Nitric oxide synthase (inducible and endothelial) Nitric-oxide synthase (endothelial and brain) eNOS
Type:
Enzyme Catalytic Domain
Mol. Mass.:
133297.84
Organism:
Homo sapiens (Human)
Description:
P29474
Residue:
1203
  
Inhibitor
Name:
BDBM106743
Synonyms:
CHEMBL1823373 | US8586620, 161
Type:
Small organic molecule
Emp. Form.:
C17H20N4S
Mol. Mass.:
312.432
SMILES:
CNCCCn1ccc2ccc(cc12)N=C(N)c1cccs1
: