Target
Tyrosine-protein phosphatase non-receptor type 1
Ligand
BDBM106793
Substrate
Meas. Tech.
PTP activity assay
pH
6±n/a
Temperature
310.15±n/a K
IC50
1.14e+4±n/a nM
Comments
extracted
Citation
 Ma, YSun, SXCheng, XCWang, SQDong, WLWang, RLXu, WR Design and synthesis of imidazolidine-2,4-dione derivatives as selective inhibitors by targeting protein tyrosine phosphatase-1B over T-cell protein tyrosine phosphatase. Chem Biol Drug Des 82:595-602 (2013)  
Target
Name:
Tyrosine-protein phosphatase non-receptor type 1
Synonyms:
PTN1_HUMAN PTPN1 Protein tyrosine phosphatase-1B (PTP1B) Protein-tyrosine phosphatase 1B (PTP1B) Tyrosine-protein phosphatase non-receptor type 1 (PTP1B)
Type:
Protein phosphatase
Mol. Mass.:
49963.76
Organism:
Homo sapiens (Human)
Description:
Human recombinant GST-fusion PTP1B (1-435).
Residue:
435
  
Inhibitor
Name:
BDBM106793
Synonyms:
(5Z)‐5‐{[3‐(2‐ phenylethoxy)phenyl]methylidene}imidazolidine‐2,4‐ dione (comp#e)
Type:
Small organic molecule
Emp. Form.:
C18H16N2O3
Mol. Mass.:
308.3312
SMILES:
O=C1NC(=O)\C(N1)=C\c1cccc(OCCc2ccccc2)c1
: