Target
Tyrosine-protein phosphatase non-receptor type 2
Ligand
BDBM106789
Substrate
Meas. Tech.
PTP activity assay
pH
6±n/a
Temperature
310.15±n/a K
IC50
3.68e+4±n/a nM
Comments
extracted
Citation
 Ma, YSun, SXCheng, XCWang, SQDong, WLWang, RLXu, WR Design and synthesis of imidazolidine-2,4-dione derivatives as selective inhibitors by targeting protein tyrosine phosphatase-1B over T-cell protein tyrosine phosphatase. Chem Biol Drug Des 82:595-602 (2013)  
Target
Name:
Tyrosine-protein phosphatase non-receptor type 2
Synonyms:
PTN2_HUMAN PTPT T-cell protein-tyrosine phosphatase TCPTP Tyrosine-protein phosphatase non-receptor type 2 (TC-PTP)
Type:
Protein
Mol. Mass.:
48481.80
Organism:
Homo sapiens (Human)
Description:
P17706
Residue:
415
  
Inhibitor
Name:
BDBM106789
Synonyms:
(5Z)‐5‐({2‐[(3‐ chlorophenyl)methoxy]phenyl}methylidene)imidazolidine‐ 2,4‐dione (comp#a)
Type:
Small organic molecule
Emp. Form.:
C17H13ClN2O3
Mol. Mass.:
328.75
SMILES:
Clc1cccc(COc2ccccc2\C=C2/NC(=O)NC2=O)c1
: