Target
Tyrosine-protein phosphatase non-receptor type 2
Ligand
BDBM106799
Substrate
Meas. Tech.
PTP activity assay
pH
6±n/a
Temperature
310.15±n/a K
IC50
3.39e+4±n/a nM
Comments
extracted
Citation
 Ma, YSun, SXCheng, XCWang, SQDong, WLWang, RLXu, WR Design and synthesis of imidazolidine-2,4-dione derivatives as selective inhibitors by targeting protein tyrosine phosphatase-1B over T-cell protein tyrosine phosphatase. Chem Biol Drug Des 82:595-602 (2013)  
Target
Name:
Tyrosine-protein phosphatase non-receptor type 2
Synonyms:
PTN2_HUMAN PTPT T-cell protein-tyrosine phosphatase TCPTP Tyrosine-protein phosphatase non-receptor type 2 (TC-PTP)
Type:
Protein
Mol. Mass.:
48481.80
Organism:
Homo sapiens (Human)
Description:
P17706
Residue:
415
  
Inhibitor
Name:
BDBM106799
Synonyms:
(5Z)‐5‐({4‐[(3,4‐ dichlorophenyl)methoxy]phenyl}methylidene)imidazolidine‐ 2,4‐dione (comp#k)
Type:
Small organic molecule
Emp. Form.:
C17H12Cl2N2O3
Mol. Mass.:
363.195
SMILES:
Clc1ccc(COc2ccc(\C=C3/NC(=O)NC3=O)cc2)cc1Cl
: