Target
D(3) dopamine receptor
Ligand
BDBM107500
Substrate
Meas. Tech.
Biochemical Assay
Ki
8.88±0.0 nM
Citation
 Rodriguez Sarmiento, RMWichmann, J Benzodioxole piperidine compounds US Patent  US8598357 Publication Date 12/3/2013 
Target
Name:
D(3) dopamine receptor
Synonyms:
DOPAMINE D3 DRD3_HUMAN Dopamine D3 receptor (D3) Dopamine receptor Dopamine receptor D3
Type:
Mol. Mass.:
44243.43
Organism:
Homo sapiens (Human)
Description:
Residue:
400
  
Inhibitor
Name:
BDBM107500
Synonyms:
US8598357, 3
Type:
Small organic molecule
Emp. Form.:
C26H38N2O5
Mol. Mass.:
458.5903
SMILES:
O=C(CC1COCCO1)N[C@H]1CC[C@H](CCN2CCC(CC2)c2cccc3OCOc23)CC1
: