Target
Amine oxidase [flavin-containing] B
Ligand
BDBM108061
Substrate
Meas. Tech.
MAO Assay
pH
7.4±n/a
Temperature
310.15±n/a K
Ki
1.8e+4± 8e+3 nM
Comments
extracted
Citation
 Coelho-Cerqueira, ENetz, PAdo Canto, VPPinto, ACFollmer, C Beyond topoisomerase inhibition: antitumor 1,4-naphthoquinones as potential inhibitors of human monoamine oxidase. Chem Biol Drug Des 83:401-10 (2014)  
Target
Name:
Amine oxidase [flavin-containing] B
Synonyms:
AOFB_HUMAN MAOB Monoamine oxidase type B (MAO B) Monoamine oxidase type B (MAOB)
Type:
Protein
Mol. Mass.:
58768.76
Organism:
Homo sapiens (Human)
Description:
P27338
Residue:
520
  
Inhibitor
Name:
BDBM108061
Synonyms:
Nor-lapachol
Type:
Small organic molecule
Emp. Form.:
C14H12O3
Mol. Mass.:
228.2433
SMILES:
CC(C)C=C1C(=O)C(=O)c2ccccc2C1=O
: