Target
Amine oxidase [flavin-containing] B
Ligand
BDBM108063
Substrate
Meas. Tech.
MAO Assay
pH
7.4±n/a
Temperature
310.15±n/a K
Ki
1.2e+4± 3e+3 nM
Comments
extracted
Citation
 Coelho-Cerqueira, ENetz, PAdo Canto, VPPinto, ACFollmer, C Beyond topoisomerase inhibition: antitumor 1,4-naphthoquinones as potential inhibitors of human monoamine oxidase. Chem Biol Drug Des 83:401-10 (2014)  
Target
Name:
Amine oxidase [flavin-containing] B
Synonyms:
AOFB_HUMAN MAOB Monoamine oxidase type B (MAO B) Monoamine oxidase type B (MAOB)
Type:
Protein
Mol. Mass.:
58768.76
Organism:
Homo sapiens (Human)
Description:
P27338
Residue:
520
  
Inhibitor
Name:
BDBM108063
Synonyms:
2‐({4‐[(3‐ aminopropyl)(benzyl)amino]butyl}amino)naphthalene‐ 1,4‐dione (Compound b2)
Type:
Small organic molecule
Emp. Form.:
C24H29N3O2
Mol. Mass.:
391.506
SMILES:
NCCCN(CCCC=Nc1cc(O)c2ccccc2c1O)Cc1ccccc1
: