Target
Epidermal growth factor receptor
Ligand
BDBM4405
Substrate
Poly(GAT)
Meas. Tech.
EGFR assay
IC50
6900±n/a nM
Citation
 Gazit, AChen, JApp, HMcMahon, GHirth, PChen, ILevitzki, A Tyrphostins IV--highly potent inhibitors of EGF receptor kinase. Structure-activity relationship study of 4-anilidoquinazolines. Bioorg Med Chem 4:1203-7 (1996)  
Target
Name:
Epidermal growth factor receptor
Synonyms:
EGF Receptor Substrate EGFR_HUMAN ERBB1 Epidermal Growth Factor Receptor erbB-1 Epidermal growth factor receptor (EGFR) HER1 Proto-oncogene c-ErbB-1 Tyrosine-Protein Kinase ErbB-1
Type:
Receptor Kinase Domain
Mol. Mass.:
134279.59
Organism:
Homo sapiens (Human)
Description:
P00533
Residue:
1210
  
Inhibitor
Name:
BDBM4405
Synonyms:
4-Anilidoquinazoline deriv. 21a | N-(3,4-dimethylphenyl)-6-methylquinazolin-4-amine
Type:
Small organic molecule
Emp. Form.:
C17H17N3
Mol. Mass.:
263.337
SMILES:
Cc1ccc2ncnc(Nc3ccc(C)c(C)c3)c2c1
:
Substrate
Name:
Poly(GAT)
Synonyms:
Type:
Peptide
Mol. Mass.:
358.43
Organism:
Description:
poly(Glu6Ala3Tyr). 125 uM [gamma-32P]ATP as co-substrate.
Residue:
3
NA