Target
Secreted chorismate mutase
Ligand
BDBM11022
Substrate
Meas. Tech.
CM Assay
Temperature
310.15±n/a K
IC50
1.08e+3± 1.0e+2 nM
Comments
extracted
Citation
 Jeankumar, VUAlokam, RSridevi, JPSuryadevara, PMatikonda, SSPeddi, SSahithi, SAlvala, MYogeeswari, PSriram, D Discovery and Structure Optimization of a Series of Isatin Derivatives as Mycobacterium tuberculosis Chorismate Mutase Inhibitors. Chem Biol Drug Des 83:498-506 (2014)  
Target
Name:
Secreted chorismate mutase
Synonyms:
Chorismate mutase (CM) Chorismate mutase-related protein | SCMU_MYCTU
Type:
Protein
Mol. Mass.:
21942.03
Organism:
Mycobacterium tuberculosis H37Rv
Description:
Residue:
199
  
Inhibitor
Name:
BDBM11022
Synonyms:
2,3-dihydro-1H-indole-2,3-dione Isatin | Isatin (Compound 1)
Type:
Small organic molecule
Emp. Form.:
C8H5NO2
Mol. Mass.:
147.1308
SMILES:
O=C1Nc2ccccc2C1=O
: