Target
Cytochrome P450 2A6
Ligand
BDBM12357
Substrate
Meas. Tech.
Inhibition Assay
IC50
1.51e+3± 3.1e+2 nM
Citation
 Cashman, JR Synthetic compounds and derivatives as modulators of smoking or nicotine ingestion and lung cancer US Patent  US8609708 Publication Date 12/17/2013 
Target
Name:
Cytochrome P450 2A6
Synonyms:
1,4-cineole 2-exo-monooxygenase CP2A6_HUMAN CYP2A6 Coumarin 7-hydroxylase Cytochrome P450 IIA3 | Cytochrome P450(I)
Type:
Protein
Mol. Mass.:
56514.34
Organism:
Homo sapiens (Human)
Description:
P11509
Residue:
494
  
Inhibitor
Name:
BDBM12357
Synonyms:
3-(1H-imidazol-4-yl)pyridine JMC514968 Compound 7 US8609708,14 | nicotine 3-heteroaromatic analogue 10
Type:
Small organic molecule
Emp. Form.:
C8H7N3
Mol. Mass.:
145.1613
SMILES:
c1nc(c[nH]1)-c1cccnc1
: