Target
Breakpoint cluster region protein [1-693]
Ligand
BDBM111452
Substrate
Meas. Tech.
Kinase Assays
IC50
483±n/a nM
Citation
 Pan, XDong, JGao, HWang, FZhang, YWang, SZhang, J Design, synthesis and biological evaluation of pyridin-3-yl pyrimidines as potent Bcr-Abl inhibitors. Chem Biol Drug Des 83:592-9 (2014)  
Target
Name:
Breakpoint cluster region protein [1-693]
Synonyms:
BCR BCR_HUMAN D22S11
Type:
Protein
Mol. Mass.:
76683.66
Organism:
Homo sapiens (Human)
Description:
P11274[1-693]
Residue:
693
  
Inhibitor
Name:
BDBM111452
Synonyms:
N-(4-bromophenyl)-4-methyl-3-(4-(pyridin-3-yl) pyrimidin-2-ylamino) benzamide (A5)
Type:
Small organic molecule
Emp. Form.:
C23H18BrN5O
Mol. Mass.:
460.326
SMILES:
Cc1ccc(cc1Nc1nccc(n1)-c1cccnc1)C(=O)Nc1ccc(Br)cc1
: