Target
Breakpoint cluster region protein [1-693]
Ligand
BDBM111470
Substrate
Meas. Tech.
Kinase Assays
IC50
>1.00e+5±n/a nM
Citation
 Pan, XDong, JGao, HWang, FZhang, YWang, SZhang, J Design, synthesis and biological evaluation of pyridin-3-yl pyrimidines as potent Bcr-Abl inhibitors. Chem Biol Drug Des 83:592-9 (2014)  
Target
Name:
Breakpoint cluster region protein [1-693]
Synonyms:
BCR BCR_HUMAN D22S11
Type:
Protein
Mol. Mass.:
76683.66
Organism:
Homo sapiens (Human)
Description:
P11274[1-693]
Residue:
693
  
Inhibitor
Name:
BDBM111470
Synonyms:
N-(4-(2-(diethylamino)ethoxy)phenyl)-4-methyl-3-(4-(pyridin-3-yl)pyrimidin-2-ylamino)benzamide (A23)
Type:
Small organic molecule
Emp. Form.:
C30H34N6O2
Mol. Mass.:
510.63
SMILES:
CCN(CC)CCCOc1ccc(NC(=O)c2ccc(C)c(Nc3nccc(n3)-c3cccnc3)c2)cc1
: