Target
Phospholipase A2
Ligand
BDBM18207
Substrate
Meas. Tech.
sPLA2-V activity assay
pH
8±n/a
Temperature
298.15±n/a K
IC50
6.1e+2± 1e+1 nM
Comments
extracted
Citation
 Ahmad, WKumolosasi, EJantan, IBukhari, SNJasamai, M Effects of novel diarylpentanoid analogues of curcumin on secretory phospholipase A2 , cyclooxygenases, lipo-oxygenase, and microsomal prostaglandin E synthase-1. Chem Biol Drug Des 83:670-81 (2014)  
Target
Name:
Phospholipase A2
Synonyms:
Group IB phospholipase A2 PLA2 PLA2G1B Phosphatidylcholine 2-acylhydrolase 1B Phospholipase A2 group 1B | phospholipase A2 precursor
Type:
Protein
Mol. Mass.:
16364.13
Organism:
Homo sapiens (Human)
Description:
P04054
Residue:
148
  
Inhibitor
Name:
BDBM18207
Synonyms:
(1R,2S,10S,11S,13R,14R,15S,17S)-1-fluoro-14,17-dihydroxy-14-(2-hydroxyacetyl)-2,13,15-trimethyltetracyclo[8.7.0.0^{2,7}.0^{11,15}]heptadeca-3,6-dien-5-one US11554172, Compound Dexamethasone dexamethasone (tetramethyl-rhodamine conjugated )
Type:
Steroid
Emp. Form.:
C22H29FO5
Mol. Mass.:
392.4611
SMILES:
[H][C@@]12C[C@@H](C)[C@](O)(C(=O)CO)[C@@]1(C)C[C@H](O)[C@@]1(F)[C@@]2([H])CCC2=CC(=O)C=C[C@]12C
: