Target
Androgen receptor
Ligand
BDBM112805
Substrate
Meas. Tech.
Biological Assay
IC50
0.5±n/a nM
Citation
 Miller, CP Selective androgen receptor modulators US Patent  US8629167 Publication Date 1/14/2014 
Target
Name:
Androgen receptor
Synonyms:
ANDR_RAT Ar Nr3c4 | androgen
Type:
Enzyme
Mol. Mass.:
98219.08
Organism:
Rattus norvegicus (Rat)
Description:
P15207
Residue:
902
  
Inhibitor
Name:
BDBM112805
Synonyms:
US8629167, 15
Type:
Small organic molecule
Emp. Form.:
C20H18Cl2N4O2
Mol. Mass.:
417.289
SMILES:
Cc1c(N[C@@H](c2nnc(o2)-c2ccc(Cl)cc2)C(C)(C)O)ccc([N+]#[C-])c1Cl
: