Target
Androgen receptor
Ligand
BDBM112824
Substrate
Meas. Tech.
Biological Assay
IC50
0.2±n/a nM
Citation
 Miller, CP Selective androgen receptor modulators US Patent  US8629167 Publication Date 1/14/2014 
Target
Name:
Androgen receptor
Synonyms:
ANDR_RAT Ar Nr3c4 | androgen
Type:
Enzyme
Mol. Mass.:
98219.08
Organism:
Rattus norvegicus (Rat)
Description:
P15207
Residue:
902
  
Inhibitor
Name:
BDBM112824
Synonyms:
US8629167, 35
Type:
Small organic molecule
Emp. Form.:
C19H15ClF2N4O2
Mol. Mass.:
404.798
SMILES:
C[C@@H](O)[C@@H](Nc1ccc(C#N)c(Cl)c1C)c1nnc(o1)-c1ccc(F)cc1F
: