Target
Androgen receptor
Ligand
BDBM112867
Substrate
Meas. Tech.
Biological Assay
IC50
1±n/a nM
Citation
 Miller, CP Selective androgen receptor modulators US Patent  US8629167 Publication Date 1/14/2014 
Target
Name:
Androgen receptor
Synonyms:
ANDR_RAT Ar Nr3c4 | androgen
Type:
Enzyme
Mol. Mass.:
98219.08
Organism:
Rattus norvegicus (Rat)
Description:
P15207
Residue:
902
  
Inhibitor
Name:
BDBM112867
Synonyms:
US8629167, 80
Type:
Small organic molecule
Emp. Form.:
C21H16ClN5O2
Mol. Mass.:
405.837
SMILES:
C[C@H](O)[C@@H](Nc1ccc([N+]#[C-])c(Cl)c1C=C)c1nnc(o1)-c1ccc(cc1)[N+]#[C-]
: