Target
Disintegrin and metalloproteinase domain-containing protein 10
Ligand
BDBM48862
Substrate
Meas. Tech.
QFRET-based biochemical high throughput dose response assay to identify exosite inhibitors of ADAM10.
IC50
4717±n/a nM
Citation
 PubChem, PC QFRET-based biochemical high throughput dose response assay to identify exosite inhibitors of ADAM10. PubChem Bioassay (2014)[AID] 
Target
Name:
Disintegrin and metalloproteinase domain-containing protein 10
Synonyms:
ADA10_HUMAN Disintegrin and metalloproteinase domain-containing protein 10 (ADAM10) MADM
Type:
Enzyme
Mol. Mass.:
84160.93
Organism:
Homo sapiens (Human)
Description:
O14672
Residue:
748
  
Inhibitor
Name:
BDBM48862
Synonyms:
6-[(3,4-dichlorophenyl)(1-pyrrolidinyl)methyl]-1,3-benzodioxol-5-ol 6-[(3,4-dichlorophenyl)-pyrrolidin-1-yl-methyl]-1,3-benzodioxol-5-ol 6-[(3,4-dichlorophenyl)-pyrrolidino-methyl]sesamol SMR000338310 | cid_3309922
Type:
Small organic molecule
Emp. Form.:
C18H17Cl2NO3
Mol. Mass.:
366.238
SMILES:
Oc1cc2OCOc2cc1C(N1CCCC1)c1ccc(Cl)c(Cl)c1
: