Target
Major prion protein
Ligand
BDBM114351
Substrate
Meas. Tech.
TRFRET-based cell-based high throughput dose response assay to identify inhibitors of cell surface Prion Protein (PRPC)
IC50
5596±n/a nM
Citation
 PubChem, PC TRFRET-based cell-based high throughput dose response assay to identify inhibitors of cell surface Prion Protein (PRPC) PubChem Bioassay (2014)[AID] 
Target
Name:
Major prion protein
Synonyms:
ALTPRP CD_antigen=CD230 PRIP PRP PrP33-35C major prion protein preproprotein
Type:
PROTEIN
Mol. Mass.:
27671.97
Organism:
Homo sapiens (Human)
Description:
ChEMBL_158887
Residue:
253
  
Inhibitor
Name:
BDBM114351
Synonyms:
MLS000417683 N-(2-methyl-5-piperidin-1-ylsulfonylphenyl)-2-quinazolin-4-ylsulfanylacetamide N-[2-methyl-5-(1-piperidinylsulfonyl)phenyl]-2-(4-quinazolinylthio)acetamide cid_5110655
Type:
Small organic molecule
Emp. Form.:
C22H24N4O3S2
Mol. Mass.:
456.581
SMILES:
Cc1ccc(cc1NC(=O)CSc1ncnc2ccccc12)S(=O)(=O)N1CCCCC1
: