Target
PC4 and SFRS1-interacting protein
Ligand
BDBM50567
Substrate
Meas. Tech.
Counterscreen for inhibitors of LEDGF/p75-dependent integration: TR-FRET-based biochemical high throughput dose response counterscreen assay to identify activators of HIV-1 Integrase multimerization
IC50
676.63±n/a nM
Citation
 PubChem, PC Counterscreen for inhibitors of LEDGF/p75-dependent integration: TR-FRET-based biochemical high throughput dose response counterscreen assay to identify activators of HIV-1 Integrase multimerization PubChem Bioassay (2014)[AID] 
Target
Name:
PC4 and SFRS1-interacting protein
Synonyms:
DFS70 LEDGF/p75 PSIP1_HUMAN lens epithelium-derived growth factor p75
Type:
Enzyme Catalytic Domain
Mol. Mass.:
60120.68
Organism:
Homo sapiens (Human)
Description:
gi_6708281
Residue:
530
  
Inhibitor
Name:
BDBM50567
Synonyms:
2-(4-hydroxy-1H-indol-3-yl)acetic acid MLS001048996 cid_7061393
Type:
Small organic molecule
Emp. Form.:
C10H9NO3
Mol. Mass.:
191.1834
SMILES:
OC(=O)Cc1c[nH]c2cccc(O)c12
: